Methyl (11R,12R,13S)-(Z)-12,13-epoxy-11-methoxy-9-octadecenoate

Normal alkane RI, non-polar column, temperature ramp

Data compiled by: NIST Mass Spectrometry Data Center, William E. Wallace, director

Column type CapillaryCapillary
Active phase HP-5MSHP-5MS
Column length (m) 30.30.
Carrier gas HeHe
Substrate
Column diameter (mm) 0.250.25
Phase thickness (μm) 0.250.25
Tstart (C) 50.50.
Tend (C) 250.250.
Heat rate (K/min) 4.4.
Initial hold (min)
Final hold (min)
I 2521.2525.
ReferenceHadaruga, Hadaruga, et al., 2006Hadaruga, Hadaruga, et al., 2006
Comment MSDC-RI MSDC-RI

References

Hadaruga, Hadaruga, et al., 2006
Hadaruga, N.G.; Hadaruga, D.I.; Paunescu, V.; Tatu, C.; Ordodi, V.L.; Bandur, G.; Lupea, A.X., Thermal stability of the linoleic acid/α- and β-cyclodextrin complexes, Food Chem., 2006, 99, 3, 500-508, https://doi.org/10.1016/j.foodchem.2005.08.012 . [all data]