2-Phenyl-4-methyl-oxadiazol-1,3,4-one-5

Reaction thermochemistry data

Data compiled by: Hussein Y. Afeefy, Joel F. Liebman, and Stephen E. Stein

Individual Reactions

2-Phenyl-5-methoxy-oxadiazol-1,3,4 = 2-Phenyl-4-methyl-oxadiazol-1,3,4-one-5

By formula: C9H8N2O2 = C9H8N2O2

Quantity Value Units Method Reference Comment
Δr-25.4 ± 1.1kcal/molCisoDessolin, Golfier, et al., 1986liquid phase

References

Dessolin, Golfier, et al., 1986
Dessolin, M.; Golfier, M.; Gonthier-Vassal, A.; Szwarc, H., 1,3-rearrangements in the heterocyclic series. VIII. Differential scanning calorimetry (DSC) study of the thermal rearrangement of 2-aryl-5-methoxy-1,3,4-oxadiazoles, Nouv. J. Chim., 1986, 10, 753-760. [all data]