Quinoline, 2,6-dimethyl-

Gas phase thermochemistry data

Data compiled by: Hussein Y. Afeefy, Joel F. Liebman, and Stephen E. Stein

Quantity Value Units Method Reference Comment
Δfgas120.9 ± 2.9kJ/molCcbRibeiro da Silva, Matos, et al., 1995

References

Ribeiro da Silva, Matos, et al., 1995
Ribeiro da Silva, M.A.V.; Matos, M.A.R.; Amaral, L.M.P.F., Standard enthalpies of formation and of sublimation of 2,6-dimethylquinoline and 2,7-dimethylquinoline, J. Chem. Thermodyn., 1995, 27, 1141-1145. [all data]