4-Ethoxy-3'-formyl-4'-benzyloxyazobenzene

Condensed phase thermochemistry data

Data compiled by: Hussein Y. Afeefy, Joel F. Liebman, and Stephen E. Stein

Quantity Value Units Method Reference Comment
Δfsolid349.2kJ/molCcbCiocazanu, Dogaru, et al., 1988
Quantity Value Units Method Reference Comment
Δcsolid-11864.8kJ/molCcbCiocazanu, Dogaru, et al., 1988

References

Ciocazanu, Dogaru, et al., 1988
Ciocazanu, I.; Dogaru, V.; Moga-Gheorghe, S.; Zavoianu, D., Structure and reactivity of azo ethers. Heats of combustion and formation of some azo ethers, Rev. Chim. (Bucharest), 1988, 39, 227-230. [all data]