3,4-Diethylphenol

Kovats' RI, non-polar column, temperature ramp

View large format table.

Column type Active phase I Reference Comment
CapillarySE-301318.Medvedovskaya, Tikhomirova, et al., 19977. K/min; Tstart: 50. C; Tend: 320. C

Normal alkane RI, non-polar column, temperature ramp

View large format table.

Column type Active phase I Reference Comment
CapillaryDB-51284.Cao, Li, et al., 201130. m/0.25 mm/0.25 μm, Helium, 40. C @ 5. min, 3. K/min, 250. C @ 20. min

References

Medvedovskaya, Tikhomirova, et al., 1997
Medvedovskaya, I.I.; Tikhomirova, S.V.; Krasavina, T.D.; Gubkina, L.N., Comparison of results of chromatographic identification of complex mixtures of organic compounds, Proc. Omsk. Univ., 1997, 4, 34-36. [all data]

Cao, Li, et al., 2011
Cao, H.; Li, Z.; Chen, X., QSRR study of GC retention indices of volatile compounds emitted from Mosla chinensis Maxim. by multiply linear regression, Chin. J. Chem., 2011, 29, 10, 2187-2196, https://doi.org/10.1002/cjoc.201180379 . [all data]