1-Methyl-9-nitrophenanthrene

Lee's RI, non-polar column, temperature ramp

Data compiled by: NIST Mass Spectrometry Data Center, William E. Wallace, director

Column type CapillaryCapillary
Active phase SE-52SE-52
Column length (m) 30.30.
Carrier gas HeHe
Substrate
Column diameter (mm) 0.30.2
Phase thickness (μm) 0.250.25
Tstart (C) 25.25.
Tend (C) 295.295.
Heat rate (K/min) 4.4.
Initial hold (min)
Final hold (min)
I 384.47383.95
ReferenceWhite, Robbat, et al., 1983White, Robbat, et al., 1983
Comment MSDC-RI MSDC-RI

References

White, Robbat, et al., 1983
White, C.M.; Robbat, A., Jr.; Hoes, R.M., Gas chromatographic retention characteristics of nitrated polycyclic aromatic hydrocarbons on SE-52, Chromatographia, 1983, 17, 11, 605-612, https://doi.org/10.1007/BF02261944 . [all data]