Benzaldehyde, 2,4-dichloro-

Phase change data

Data compiled as indicated in comments:
BS - Robert L. Brown and Stephen E. Stein
TRC - Thermodynamics Research Center, NIST Boulder Laboratories, Chris Muzny director
AC - William E. Acree, Jr., James S. Chickos

Quantity Value Units Method Reference Comment
Tboil506.2KN/AAldrich Chemical Company Inc., 1990BS
Quantity Value Units Method Reference Comment
Tfus345.KN/Avan de Lande, 1932Uncertainty assigned by TRC = 4. K; TRC

Enthalpy of fusion

ΔfusH (kJ/mol) Temperature (K) Reference Comment
20.47347.2Wang, Tan, et al., 2004AC

In addition to the Thermodynamics Research Center (TRC) data available from this site, much more physical and chemical property data is available from the following TRC products:

References

Aldrich Chemical Company Inc., 1990
Aldrich Chemical Company Inc., Catalog Handbook of Fine Chemicals, Aldrich Chemical Company, Inc., Milwaukee WI, 1990, 1. [all data]

van de Lande, 1932
van de Lande, L.M.F., The Action of Sodium Methylate on SOme Derivatives of m-Dichlorobenzene, Recl. Trav. Chim. Pays-Bas, 1932, 51, 98-113. [all data]

Wang, Tan, et al., 2004
Wang, Shao-Xu; Tan, Zhi-Cheng; Di, You-Ying; Xu, Fen; Zhang, Hong-Tao; Sun, Li-Xian; Zhang, Tao, Heat capacity and thermodynamic properties of 2,4-dichlorobenzaldehyde (C7H4Cl2O), The Journal of Chemical Thermodynamics, 2004, 36, 5, 393-399, https://doi.org/10.1016/j.jct.2004.01.006 . [all data]