1H-Pyrazole, 1-methyl-3-(methylthio)

Gas phase ion energetics data

Data compiled by: Sharon G. Lias, John E. Bartmess, Joel F. Liebman, John L. Holmes, Rhoda D. Levin, and W. Gary Mallard

Ionization energy determinations

IE (eV) Method Reference Comment
7.3PEGuimon, Pfister-Guillouzo, et al., 1983
8.0PEGuimon, Pfister-Guillouzo, et al., 1983Vertical value

References

Guimon, Pfister-Guillouzo, et al., 1983
Guimon, C.; Pfister-Guillouzo, G.; Begtrup, M., Tautomerism of Pyrazoline-5-thione and Trazoline-5-thione Studied by Variable Temperature Photoelectron Spectroscopy, Can. J. Chem., 1983, 61, 1197. [all data]