Nitrous acid, 3-methyl-3-butenyl ester

Gas phase ion energetics data

Data compiled by: Sharon G. Lias, John E. Bartmess, Joel F. Liebman, John L. Holmes, Rhoda D. Levin, and W. Gary Mallard

Ionization energy determinations

IE (eV) Method Reference Comment
9.5PESchultz, Houle, et al., 1984Vertical value

References

Schultz, Houle, et al., 1984
Schultz, J.C.; Houle, F.A.; Beauchamp, J.L., Photoelectron spectroscopy of isomeric C4H7 radicals. Implications for the thermochemistry and structures of the radicals and their corresponding carbonium ions, J. Am. Chem. Soc., 1984, 106, 7336. [all data]