C8H5NO2

Reaction thermochemistry data

Data compiled by: John E. Bartmess

Individual Reactions

C8H4NO2- + Hydrogen cation = C8H5NO2

By formula: C8H4NO2- + H+ = C8H5NO2

Quantity Value Units Method Reference Comment
Δr1496. ± 8.8kJ/molG+TSMustanir, Than, et al., 2005gas phase
Quantity Value Units Method Reference Comment
Δr1464. ± 8.4kJ/molIMREMustanir, Than, et al., 2005gas phase

References

Mustanir, Than, et al., 2005
Mustanir; Than, S.; Mishima, M., Substituent effects on the gas phase acidity of phenylacetylenes and benzyl alcohols, Bull. Chem. Soc. Japan, 2005, 78, 1, 147-153, https://doi.org/10.1246/bcsj.78.147 . [all data]