1,1'-Biphenyl, 2-methoxy-

Normal alkane RI, non-polar column, temperature ramp

View large format table.

Column type Active phase I Reference Comment
CapillaryBPX51574.Dickschat, Bode, et al., 200525. m/0.22 mm/0.25 μm, Helium, 50. C @ 5. min, 5. K/min; Tend: 320. C
CapillaryUltra-11511.Okumura, 199125. m/0.32 mm/0.25 μm, He, 3. K/min; Tstart: 80. C; Tend: 260. C

Normal alkane RI, polar column, custom temperature program

View large format table.

Column type Active phase I Reference Comment
CapillaryDB-Wax2246.Peng, Yang, et al., 1991Program: not specified

References

Dickschat, Bode, et al., 2005
Dickschat, J.S.; Bode, H.B.; Wenzel, S.C.; Muller, R.; Schulz, S., Biosinthesis and Identification of Volatiles Released by the Myxobacterium Stigmatella aurantiaca, ChemBioChem, 2005, 6, 11, 2023-2033, https://doi.org/10.1002/cbic.200500174 . [all data]

Okumura, 1991
Okumura, T., retention indices of environmental chemicals on methyl silicone capillary column, Journal of Environmental Chemistry (Japan), 1991, 1, 2, 333-358, https://doi.org/10.5985/jec.1.333 . [all data]

Peng, Yang, et al., 1991
Peng, C.T.; Yang, Z.C.; Ding, S.F., Prediction of rentention idexes. II. Structure-retention index relationship on polar columns, J. Chromatogr., 1991, 586, 1, 85-112, https://doi.org/10.1016/0021-9673(91)80028-F . [all data]