Brompheniramine

Kovats' RI, non-polar column, temperature ramp

Data compiled by: NIST Mass Spectrometry Data Center, William E. Wallace, director

Column type Capillary
Active phase Methyl Silicone
Column length (m) 12.
Carrier gas He
Substrate
Column diameter (mm) 0.20
Phase thickness (μm) 0.33
Tstart (C) 100.
Tend (C) 310.
Heat rate (K/min) 30.
Initial hold (min) 3.
Final hold (min) 5.
I 2105.
ReferenceMaurer and Pfleger, 1988
Comment MSDC-RI

Kovats' RI, non-polar column, custom temperature program

Data compiled by: NIST Mass Spectrometry Data Center, William E. Wallace, director

Column type Packed
Active phase OV-101
Column length (m) 2.
Carrier gas N2
Substrate Chromosorb W
Column diameter (mm)
Phase thickness (μm)
Program not specified
I 2090.
ReferenceMcLinden and Stenhouse, 1979
Comment MSDC-RI

Normal alkane RI, non-polar column, temperature ramp

Data compiled by: NIST Mass Spectrometry Data Center, William E. Wallace, director

Column type PackedPackedPacked
Active phase SE-30OV-1SE-30
Column length (m) 2.2.2.
Carrier gas Nitrogen
Substrate Chromosorb G AW DMCS (80-100 mesh)Gas Chrom PGas Chrom P
Column diameter (mm)
Phase thickness (μm)
Tstart (C) 100.120.120.
Tend (C) 300.200.200.
Heat rate (K/min)  2.52.5
Initial hold (min)
Final hold (min)
I 2096.2080.2115.
ReferenceMHA, 9999Marozzi, Gambaro, et al., 1982Marozzi, Gambaro, et al., 1982
Comment MSDC-RI MSDC-RI MSDC-RI

References

Maurer and Pfleger, 1988
Maurer, H.; Pfleger, K., Identification and Differentiation of Alkylamine Antihistamines and Their Metabolites in Urine by Computerized Gas Chromatography-Mass Spectrometry, J. Chromatogr., 1988, 430, 31-41, https://doi.org/10.1016/S0378-4347(00)83131-X . [all data]