N,N'-Diethyl-N,N'-diphenylurea

Kovats' RI, non-polar column, temperature ramp

View large format table.

Column type Active phase I Reference Comment
PackedOV-1011882.Alley and Dykes, 19726. K/min; Tstart: 70. C; Tend: 220. C

References

Alley and Dykes, 1972
Alley, B.J.; Dykes, H.W.H., Gas-Liquid Chromatographic Determination of Nitrate Esters,Stabilizers and Plasticizers in Nitrocellulose-Base Propellants, J. Chromatogr., 1972, 71, 1, 23-37, https://doi.org/10.1016/S0021-9673(01)85687-9 . [all data]