Dibucaine

Kovats' RI, non-polar column, custom temperature program

Data compiled by: NIST Mass Spectrometry Data Center, William E. Wallace, director

Column type Packed
Active phase OV-101
Column length (m) 2.
Carrier gas N2
Substrate Chromosorb W
Column diameter (mm)
Phase thickness (μm)
Program not specified
I 2740.
ReferenceMcLinden and Stenhouse, 1979
Comment MSDC-RI

Van Den Dool and Kratz RI, non-polar column, temperature ramp

Data compiled by: NIST Mass Spectrometry Data Center, William E. Wallace, director

Column type CapillaryCapillaryCapillaryCapillaryPacked
Active phase SPB-1CBP-1DB-1DB-1SE-30
Column length (m) 30.12.15.15.1.8
Carrier gas HeN2HeHeN2
Substrate     Chromosorb W
Column diameter (mm) 0.750.530.320.25
Phase thickness (μm) 1.0 0.250.25
Tstart (C) 160.120.120.120.130.
Tend (C) 280.250.280.280.290.
Heat rate (K/min) 10.6.8.8.8.
Initial hold (min)     2.
Final hold (min) 12. 5.5.8.
I 2706.2677.2693.2693.2690.
ReferenceChrist, Noomano, et al., 1988Oyama, Sano, et al., 1987Perrigo, Peel, et al., 1985Perrigo, Ballantyne, et al., 1984Perrigo and Peel, 1981
Comment MSDC-RI MSDC-RI MSDC-RI MSDC-RI MSDC-RI

References

McLinden and Stenhouse, 1979
McLinden, V.J.; Stenhouse, A.M., A chromatography system for drug identification, Forensic Sci. Int., 1979, 13, 71-79, https://doi.org/10.1016/0379-0738(79)90265-2 . [all data]