Trimeprazine

Kovats' RI, non-polar column, temperature ramp

Data compiled by: NIST Mass Spectrometry Data Center, William E. Wallace, director

Column type Packed
Active phase OV-101
Column length (m) 0.6
Carrier gas N2
Substrate Chromosorb G HP
Column diameter (mm)
Phase thickness (μm)
Tstart (C) 100.
Tend (C) 310.
Heat rate (K/min) 30.
Initial hold (min) 3.
Final hold (min) 5.
I 2315.
ReferenceMaurer and Pfleger, 1988
Comment MSDC-RI

Normal alkane RI, non-polar column, custom temperature program

Data compiled by: NIST Mass Spectrometry Data Center, William E. Wallace, director

Column type PackedOther
Active phase OV-101Methyl Silicone
Column length (m) 2.
Carrier gas
Substrate Gas Chrom Q
Column diameter (mm)
Phase thickness (μm)
Program not specifiednot specified
I 2354.2309.
ReferenceBuydens, Massart, et al., 1985Ardrey and Moffat, 1981
Comment MSDC-RI MSDC-RI

References

Maurer and Pfleger, 1988
Maurer, H.; Pfleger, K., Identification of phenothiazine antihistamines and their metabolites in urine, Arch. Toxicol., 1988, 62, 2-3, 185-191, https://doi.org/10.1007/BF00570138 . [all data]