9,10-Anthracenedione, 2-(1,1-dimethylethyl)-

Gas phase ion energetics data

Data compiled by: John E. Bartmess

Electron affinity determinations

EA (eV) Method Reference Comment
1.557 ± 0.061TDEqHeinis, Chowdhury, et al., 1988ΔGea(423 K) = -34.7 kcal/mol; ΔSea (estimated) = -2.9 eu

Phase change data

Data compiled by: William E. Acree, Jr., James S. Chickos

Enthalpy of vaporization

ΔvapH (kJ/mol) Temperature (K) Method Reference Comment
101.4498.AStephenson and Malanowski, 1987Based on data from 483. - 523. K.

References

Heinis, Chowdhury, et al., 1988
Heinis, T.; Chowdhury, S.; Scott, S.L.; Kebarle, P., Electron Affinities of Benzo-, Naphtho-, and Anthraquinones Determined from Gas-Phase Equilibria Measurements, J. Am. Chem. Soc., 1988, 110, 2, 400, https://doi.org/10.1021/ja00210a015 . [all data]