Tetrahydrozoline

Normal alkane RI, non-polar column, custom temperature program

Data compiled by: NIST Mass Spectrometry Data Center, William E. Wallace, director

Column type Other
Active phase Methyl Silicone
Column length (m)
Carrier gas
Substrate
Column diameter (mm)
Phase thickness (μm)
Program not specified
I 1833.
ReferenceArdrey and Moffat, 1981
Comment MSDC-RI

Gas phase ion energetics data

Data compiled by: Sharon G. Lias, Rhoda D. Levin, and Sherif A. Kafafi

Ionization energy determinations

IE (eV) Method Reference Comment
8.33PEDe Jong and van Dam, 1979Vertical value

References

Ardrey and Moffat, 1981
Ardrey, R.E.; Moffat, A.C., Gas-liquid chromatographic retention indices of 1318 substances of toxicological interest on SE-30 or OV-1 stationary phase, J. Chromatogr., 1981, 220, 3, 195-252, https://doi.org/10.1016/S0021-9673(00)81925-1 . [all data]