Phosphine, diphenyl-

Gas phase ion energetics data

Data compiled as indicated in comments:
LLK - Sharon G. Lias, Rhoda D. Levin, and Sherif A. Kafafi

Ionization energy determinations

IE (eV) Method Reference Comment
7.80 ± 0.01PEDebies and Rabalais, 1974LLK

References

Debies and Rabalais, 1974
Debies, T.P.; Rabalais, J.W., Photoelectron spectra of substituted benzenes. III. Bonding with Group V substituents, Inorg. Chem., 1974, 13, 308. [all data]