1H-Indene, 2,3-dihydro-4-methyl-

Kovats' RI, non-polar column, isothermal

Data compiled by: NIST Mass Spectrometry Data Center, William E. Wallace, director

Column type CapillaryCapillaryCapillaryCapillaryCapillary
Active phase CP Sil 2SE-30SqualaneSqualaneSqualane
Column length (m) 100.15.
Carrier gas  N2
Substrate
Column diameter (mm) 0.250.25
Phase thickness (μm) 0.25
Temperature (C) 80.70.110.90.92.
I 1144.01120.61130.1122.1126.
ReferenceEstel, Mohnke, et al., 1995Tóth, 1983Bogoslovsky, Anvaer, et al., 1978Bogoslovsky, Anvaer, et al., 1978Bogoslovsky, Anvaer, et al., 1978
Comment MSDC-RI MSDC-RI MSDC-RI MSDC-RI MSDC-RI

Normal alkane RI, non-polar column, isothermal

Data compiled by: NIST Mass Spectrometry Data Center, William E. Wallace, director

Column type Capillary
Active phase Squalane
Column length (m) 100.
Carrier gas N2
Substrate
Column diameter (mm) 0.25
Phase thickness (μm)
Temperature (C) 110.
I 1130.
ReferencePapazova and Pankova, 1975
Comment MSDC-RI

References

Estel, Mohnke, et al., 1995
Estel, D.; Mohnke; Biermans; Rotzsche, The analysis of C4-C11 hydrocarbons in naphtha and reformate with a new apolar fused silica column, J. Hi. Res. Chromatogr., 1995, 18, 7, 403-412, https://doi.org/10.1002/jhrc.1240180703 . [all data]

Tóth, 1983
Tóth, T., Use of capillary gas chromatography in collecting retention and chemical information for the analysis of complex petrochemical mixtures, J. Chromatogr., 1983, 279, 157-165, https://doi.org/10.1016/S0021-9673(01)93614-3 . [all data]

Bogoslovsky, Anvaer, et al., 1978
Bogoslovsky, Yu.N.; Anvaer, B.I.; Vigdergauz, M.S., Chromatographic constants in gas chromatography (in Russian), Standards Publ. House, Moscow, 1978, 192. [all data]