1H-Benz[de]isoquinoline-1,3(2H)-dione

Gas phase ion energetics data

Data compiled by: Sharon G. Lias, Rhoda D. Levin, and Sherif A. Kafafi

Ionization energy determinations

IE (eV) Method Reference Comment
8.68 ± 0.05PEBigotto, Galasso, et al., 1979Vertical value

References

Bigotto, Galasso, et al., 1979
Bigotto, A.; Galasso, V.; Distefano, G.; Modelli, A., Photoelectron and electronic spectra of acenaphthenequinone, naphthalic anhydride, and naphthalimide, J. Chem. Soc. Perkin Trans. 2, 1979, 1502. [all data]