2-Methyl-1,2-propanediamine

Gas phase thermochemistry data

Data compiled by: Hussein Y. Afeefy, Joel F. Liebman, and Stephen E. Stein

Quantity Value Units Method Reference Comment
Δfgas-21.57 ± 0.17kcal/molCcrGood and Moore, 1970

References

Good and Moore, 1970
Good, W.D.; Moore, R.T., Enthalpies of formation of ethylenediamine, 1,2,-propanediamine, 1,2,-butanediamine, 2-methyl-1,2-propanediamine, and isobutylamine C-N and N-F Thermochemical bond energies, J. Chem. Eng. Data, 1970, 15, 150-154. [all data]