Mercury bis(ethanethiolate)

Gas phase ion energetics data

Data compiled by: Sharon G. Lias, Rhoda D. Levin, and Sherif A. Kafafi

Ionization energy determinations

IE (eV) Method Reference Comment
8.69 ± 0.05PEBiscarini, Colonna, et al., 1981Vertical value

References

Biscarini, Colonna, et al., 1981
Biscarini, P.; Colonna, F.P.; Guerra, M.; Distefano, G., Mercury-sulphur bonding in some di(alkylthio)mercury(II) compounds studied by means of ultraviolet photoelectron apectroscopy, Inorg. Chim. Acta, 1981, 50, 243. [all data]