2-Imidazolidinone, 1,3-dimethyl-

Phase change data

Data compiled as indicated in comments:
BS - Robert L. Brown and Stephen E. Stein
AC - William E. Acree, Jr., James S. Chickos

Reduced pressure boiling point

Tboil (K) Pressure (bar) Reference Comment
380.20.023Aldrich Chemical Company Inc., 1990BS
382. - 383.0.024Frinton Laboratories Inc., 1986BS

Enthalpy of vaporization

ΔvapH (kJ/mol) Temperature (K) Method Reference Comment
54.3375.EBKneisl and Zondlo, 1987Based on data from 355. - 498. K.; AC
48.5450.EBKneisl and Zondlo, 1987Based on data from 355. - 498. K.; AC

References

Aldrich Chemical Company Inc., 1990
Aldrich Chemical Company Inc., Catalog Handbook of Fine Chemicals, Aldrich Chemical Company, Inc., Milwaukee WI, 1990, 1. [all data]

Frinton Laboratories Inc., 1986
Frinton Laboratories Inc., Catalog Number 11, Frinton Laboratories Inc., Vineland, NJ, 1986, 99. [all data]

Kneisl and Zondlo, 1987
Kneisl, Philip; Zondlo, John W., Vapor pressure, liquid density, and the latent heat of vaporization as functions of temperature for four dipolar aprotic solvents, J. Chem. Eng. Data, 1987, 32, 1, 11-13, https://doi.org/10.1021/je00047a003 . [all data]