CH2O2S

Reaction thermochemistry data

Data compiled by: John E. Bartmess

Individual Reactions

CHO2S- + Hydrogen cation = CH2O2S

By formula: CHO2S- + H+ = CH2O2S

Quantity Value Units Method Reference Comment
Δr1501. ± 13.kJ/molG+TSDownard, Bowie, et al., 1992gas phase; Acidity between CF3CH2OH, MeNO2. From MeSO- + O2 ->
Quantity Value Units Method Reference Comment
Δr1473. ± 13.kJ/molIMRBDownard, Bowie, et al., 1992gas phase; Acidity between CF3CH2OH, MeNO2. From MeSO- + O2 ->

References

Downard, Bowie, et al., 1992
Downard, K.M.; Bowie, J.H.; O'Hair, R.A.J.; Krempp, M.; DePuy, C.H., Gas Phase Reactions of the Methylsulfinyl and Methyldisulfide Anions, Int. J. Mass Spectrom. Ion Proc., 1992, 120, 3, 217, https://doi.org/10.1016/0168-1176(92)85050-A . [all data]