Chloromethyl 4-chloro-octanoate

Kovats' RI, non-polar column, isothermal

Data compiled by: NIST Mass Spectrometry Data Center, William E. Wallace, director

Column type CapillaryCapillaryCapillary
Active phase SE-30SE-30SE-30
Column length (m) 25.25.25.
Carrier gas N2N2N2
Substrate
Column diameter (mm) 0.220.220.22
Phase thickness (μm)
Temperature (C) 140.160.180.
I 1451.1443.1458.
ReferenceHaken, Madden, et al., 1984Haken, Madden, et al., 1984Haken, Madden, et al., 1984
Comment MSDC-RI MSDC-RI MSDC-RI

References

Haken, Madden, et al., 1984
Haken, J.K.; Madden, B.G.; Korhonen, I.O.O., Gas chromatography of homologous esters. XXVI. Capillary column studies of the chloromethyl esters of C5-C12 n-carboxylic acids, J. Chromatogr., 1984, 298, 150-158, https://doi.org/10.1016/S0021-9673(01)92703-7 . [all data]