Chloromethyl 2-chlorohexanoate

Kovats' RI, polar column, isothermal

Data compiled by: NIST Mass Spectrometry Data Center, William E. Wallace, director

Column type CapillaryCapillaryCapillary
Active phase Carbowax 20MCarbowax 20MCarbowax 20M
Column length (m) 22.22.22.
Carrier gas N2N2N2
Substrate
Column diameter (mm) 0.30.30.3
Phase thickness (μm)
Temperature (C) 120.140.160.
I 1704.1713.1733.
ReferenceHaken, Madden, et al., 1984Haken, Madden, et al., 1984Haken, Madden, et al., 1984
Comment MSDC-RI MSDC-RI MSDC-RI

Kovats' RI, non-polar column, isothermal

View large format table.

Column type Active phase Temperature (C) I Reference Comment
CapillarySE-30100.1194.Haken, Madden, et al., 1984N2; Column length: 25. m; Column diameter: 0.22 mm
CapillarySE-30120.1204.Haken, Madden, et al., 1984N2; Column length: 25. m; Column diameter: 0.22 mm
CapillarySE-30140.1207.Haken, Madden, et al., 1984N2; Column length: 25. m; Column diameter: 0.22 mm
CapillarySE-30160.1199.Haken, Madden, et al., 1984N2; Column length: 25. m; Column diameter: 0.22 mm

References

Haken, Madden, et al., 1984
Haken, J.K.; Madden, B.G.; Korhonen, I.O.O., Gas chromatography of homologous esters. XXVI. Capillary column studies of the chloromethyl esters of C5-C12 n-carboxylic acids, J. Chromatogr., 1984, 298, 150-158, https://doi.org/10.1016/S0021-9673(01)92703-7 . [all data]