N-Nitro(bis(2,2,2-trinitro-ethoxy)methyl)amine

Condensed phase thermochemistry data

Data compiled by: Hussein Y. Afeefy, Joel F. Liebman, and Stephen E. Stein

Quantity Value Units Method Reference Comment
Δfsolid-387.4 ± 3.8kJ/molCcbKustova, Kirpichev, et al., 1981
Quantity Value Units Method Reference Comment
Δcsolid-3116.7kJ/molCcbKustova, Kirpichev, et al., 1981

References

Kustova, Kirpichev, et al., 1981
Kustova, L.V.; Kirpichev, E.P.; Rubtsov, Yu.I.; Avdonin, V.V.; Korepin, A.G.; Eremenko, L.T., Standard enthalpies of formation of certain nitro compounds, Bull. Acad. Sci. USSR, Div. Chem. Sci., 1981, 1830-1836. [all data]