α-Terpinyl acetate

Normal alkane RI, polar column, custom temperature program

Data compiled by: NIST Mass Spectrometry Data Center, William E. Wallace, director

Column type CapillaryCapillaryCapillaryCapillaryCapillary
Active phase DB-WaxDB-WaxHP-20MDB-Wax EtrHP-Innowax FSC
Column length (m) 15.15. 60.60.
Carrier gas HeliumHelium HeHe
Substrate
Column diameter (mm) 0.250.25 0.250.25
Phase thickness (μm) 0.250.25 0.50.25
Program 50 0C (5 min) 6 0C/min -> 125 0C 10 0C/min -> 170 0C50 0C (5 min) 6 0C/min -> 125 0C 10 0C/min -> 170 0Cnot specified40C(3min) => 10C/min => 90C => 2C/min => 230C (37min)60C(10min) => 4C/min => 220C(10min) => 1C/min => 240C
I 1664.1676.1695.1709.1709.
ReferenceKeefover-Ring, Thompson, et al., 2009Keefover-Ring, Thompson, et al., 2009Chaieb, Hajlaoui, et al., 2007Loskos, Hernandez-Orte, et al., 2007Tabanca N., Demirci B., et al., 2007
Comment MSDC-RI MSDC-RI MSDC-RI MSDC-RI MSDC-RI
Column type CapillaryCapillaryCapillaryCapillaryCapillary
Active phase HP-Innowax FSCHP-Innowax FSCHP-Innowax FSCHP-InnowaxCarbowax 20M
Column length (m) 60.60.60.50.
Carrier gas N2HeHe
Substrate
Column diameter (mm) 0.250.250.250.2
Phase thickness (μm) 0.250.250.250.2
Program 60C(10min) => 4C/min => 220C => (10min) => 1C/min => 240C60C(10min) => 4C/min => 220C(10min) => 1C/min => 240C60C(10min) => 4C/min => 220C(10min) => 1C/min => 240Cnot specifiednot specified
I 1709.1709.1709.1709.1687.
ReferenceTabanca, Demirci, et al., 2006Sezik E., Kocakulak E., et al., 2005Kivcak, Akay, et al., 2004Senatore, Apostolides Arnold, et al., 2004Vinogradov, 2004
Comment MSDC-RI MSDC-RI MSDC-RI MSDC-RI MSDC-RI
Column type CapillaryCapillaryCapillaryCapillaryCapillary
Active phase Carbowax 20MInnowax FSCHP-Innowax FSCHP-Innowax FSCHP-Innowax
Column length (m)  60.60.60.60.
Carrier gas  HeHeHeHe
Substrate
Column diameter (mm)  0.250.250.250.25
Phase thickness (μm)  0.250.250.250.25
Program not specified60C(10min) => 4C/min => 220C (10min) => 1C/min => 240C60C (10min) => 4C/min => 220C (10min) => 1C/min => 240C60C(10min) => 4C/min => 220C(10min) => 1C/min => 240C60 0C (10 min) 4 K/min -> 220 0C (10 min) 1 K/min -> 240 0C
I 1695.1709.1709.1709.1709.
ReferenceVinogradov, 2004Baser, Demirci, et al., 2003Demirci, Baser, et al., 2003Demirci, Demirci, et al., 2003Baser, Demirci, et al., 2002
Comment MSDC-RI MSDC-RI MSDC-RI MSDC-RI MSDC-RI
Column type CapillaryCapillaryCapillaryCapillaryCapillary
Active phase Supelcowax-10HP-Innowax FSCInnowax FSCInnowaxHP-Innowax FSC
Column length (m) 60.60.60.60.60.
Carrier gas He HeHeHe
Substrate
Column diameter (mm) 0.250.250.250.250.25
Phase thickness (μm) 0.250.250.25 0.25
Program 40C (7min) => 4C/min => 150C => 8C/min => 240C (10min)60C(10min) => 4C/min => 220C(10min) => 1C/min => 240C60C(10min) => 4C/min => 220C(10min) => 1C/min => 240C60 0C (10 min) 4 K/min -> 220 0C (10 min) 1 K/min -> 240 0C60C(10min) => 4C/min => 220C(10min) => 1C/min => 240C
I 1727.1709.1709.1709.1707.
ReferenceKim and Lee, 2002Kaya, Demirci, et al., 2001Tabanca N., Demirci F., et al., 2001Ahmed, Choudhary, et al., 2000Bagci, Baser, et al., 1999
Comment MSDC-RI MSDC-RI MSDC-RI MSDC-RI MSDC-RI
Column type CapillaryCapillary
Active phase Supelcowax 10Supelcowax 10
Column length (m) 60.60.
Carrier gas HeliumHelium
Substrate
Column diameter (mm) 0.250.25
Phase thickness (μm) 0.250.25
Program 60 0C (10 min) 2 0C/min -> 80 0C 3 0C/min -> 100 0C 4 0C/min -> 220 0C (30 min)not specified
I 1705.1706.
ReferenceCastioni and Kapetanidis, 1996Castioni and Kapetanidis, 1996
Comment MSDC-RI MSDC-RI

Kovats' RI, polar column, temperature ramp

Data compiled by: NIST Mass Spectrometry Data Center, William E. Wallace, director

Column type CapillaryCapillaryCapillary
Active phase InnowaxCarbowax 20MCarbowax 20M
Column length (m) 30.50.50.
Carrier gas He
Substrate
Column diameter (mm) 0.250.320.32
Phase thickness (μm) 0.250.20.2
Tstart (C) 50.60.60.
Tend (C) 250.260.260.
Heat rate (K/min) 0.52.2.
Initial hold (min) 5.
Final hold (min) 10.
I 1685.1687.1687.
ReferenceViña and Murillo, 2003Vera and Chane-Ming, 1999Vera and Chane-Ming, 1999
Comment MSDC-RI MSDC-RI MSDC-RI

Van Den Dool and Kratz RI, non-polar column, custom temperature program

Data compiled by: NIST Mass Spectrometry Data Center, William E. Wallace, director

Column type CapillaryCapillaryCapillaryCapillaryCapillary
Active phase HP-5MSVF-5MSBPX-5BPX-5SE-52
Column length (m) 30.30.30.30.25.
Carrier gas HeHe  H2
Substrate
Column diameter (mm) 0.250.250.250.250.32
Phase thickness (μm) 0.250.250.250.250.43
Program 60C (1 min) => 5 C/min => 210C => 10 C/min => 280C (15 min)Multi-step temperature program; T(initial)=60C; T(final)=270C35C(5min) => 3C/min => 210C => 40C/min => 240C (4min)35C(5min) => 3C/min => 210C => 40C/min => 240C (4min)60C(8min) => 3C/min => 180C => 20C/min => 250C(10min)
I 1355.51362.31307.1359.1362.
ReferenceAndriamaharavo, 2014Tret'yakov, 2007Cardeal, da Silva, et al., 2006Cardeal, da Silva, et al., 2006Lorenzo, Paz, et al., 2005
Comment MSDC-RI MSDC-RI MSDC-RI MSDC-RI MSDC-RI
Column type CapillaryCapillaryCapillaryCapillaryCapillary
Active phase 5 % Phenyl methyl siloxaneSE-52HP-5BP-1CP Sil 5 CB
Column length (m) 30.25.30.
Carrier gas HeHeHe
Substrate
Column diameter (mm) 0.320.250.25
Phase thickness (μm) 0.150.250.25
Program 45C => 1C/min => 100C => 5C/min => 250C (10min)60C(8min) => 3C/min => 180C => 20C/min => 230C50C => 6C/min => 100C => 4C/min => 280Cnot specifiednot specified
I 1349.1346.1351.1332.1333.
ReferenceSacchetti, Maietti, et al., 2005Lorenzo, Loayza, et al., 2003Isidorov, Krajewska, et al., 2001Filippini, Tomi, et al., 2000Chanegriha, Baaliouamer, et al., 1998
Comment MSDC-RI MSDC-RI MSDC-RI MSDC-RI MSDC-RI
Column type Capillary
Active phase SE-52
Column length (m) 60.
Carrier gas He
Substrate
Column diameter (mm) 0.32
Phase thickness (μm) 0.40
Program 45 C (6 min) 3 C/min -> 111 0C 2 C/min -> 160 C 3 C/min -> 300 C (15 min)
I 1353.
ReferenceMondello, Dugo, et al., 1995
Comment MSDC-RI

References

Keefover-Ring, Thompson, et al., 2009
Keefover-Ring, K.; Thompson, J.D.; Linhart, Y.B., Beyond six scents: defining a seventh Thymus vulgaris chemotype new to souithern France by ethanol extraction, Flavour Fragr. J., 2009, 24, 3, 117-122, https://doi.org/10.1002/ffj.1921 . [all data]

Chaieb, Hajlaoui, et al., 2007
Chaieb, K.; Hajlaoui, H.; Zmantar, T.; Ben Kahla-Nakbi, A.; Rouabhia, M.; Mahdouani, K.; Bakhrouf, A., The chemical composition and biological activity of clove essential oil, Eugenia caryophyllata (Syzigium aromaticum L. Myrtaceae): a short review, Phytoterapy Res., 2007, 21, 6, 501-506, https://doi.org/10.1002/ptr.2124 . [all data]

Loskos, Hernandez-Orte, et al., 2007
Loskos, N.; Hernandez-Orte, P.; Cacho, J.; Ferreira, V., Release and formation of varietal aroma compounds during alcoholic fermentation from nonfloral grape odorless flavor precursors fractions, J. Agric. Food Chem., 2007, 55, 16, 6674-6684, https://doi.org/10.1021/jf0702343 . [all data]

Tabanca N., Demirci B., et al., 2007
Tabanca N.; Demirci B.; Baser K.H.C.; Mincsovics E.; Khan S.I.; Jacob M.R.; Wedge D.E., Characterization of volatile constituents of Scaligeria tripartita and studies on the antifungal activity against phytopathogenic fungi, J. Chromatogr. B, 2007, 850, 1-2, 221-229, https://doi.org/10.1016/j.jchromb.2006.11.041 . [all data]

Tabanca, Demirci, et al., 2006
Tabanca, N.; Demirci, B.; Can Baser, K.H.; Aytac, Z.; Ekici, M.; Khan, S.I.; Jacob, M.R.; Wedge, D.E., Chemical Composition and Antifungal Activity of Salvia macrochlamys and Salvia recognita Essential Oils, J. Agric. Food Chem., 2006, 54, 18, 6593-6597, https://doi.org/10.1021/jf0608773 . [all data]

Sezik E., Kocakulak E., et al., 2005
Sezik E.; Kocakulak E.; Baser K.H.C.; Ozek T., Composition of the essential oils of Juniperus oxycedrus subsp macrocarpa from Turkey, Chem. Nat. Compd. (Engl. Transl.), 2005, 41, 3, 352-354, https://doi.org/10.1007/s10600-005-0149-0 . [all data]

Kivcak, Akay, et al., 2004
Kivcak, B.; Akay, S.; Demirci, B.; Baser, K.H.C., Chemical composition of essential oils from leaves and twigs of Pistacia lentiscus, Pistacia lentiscus var. chia, and Pistacia terebinthus from Turkey, Pharm. Biol, 2004, 42, 4-5, 360-366, https://doi.org/10.1080/13880200490519677 . [all data]

Senatore, Apostolides Arnold, et al., 2004
Senatore, F.; Apostolides Arnold, N.; Piozzi, F., Chemical composition of the essential oil of Salvia multicaulis Vahl. var. simplicifolia Boiss. growing wild in Lebanon, J. Chromatogr. A, 2004, 1052, 1-2, 237-240, https://doi.org/10.1016/j.chroma.2004.08.095 . [all data]

Vinogradov, 2004
Vinogradov, B.A., Production, composition, properties and application of essential oils, 2004, retrieved from http://viness.narod.ru. [all data]

Baser, Demirci, et al., 2003
Baser, K.H.C.; Demirci, B.; Dekebo, A.; Dagne, E., Essential oils of some Boswellia spp., myrrh and opopanax, Flavour Fragr. J., 2003, 18, 2, 153-156, https://doi.org/10.1002/ffj.1166 . [all data]

Demirci, Baser, et al., 2003
Demirci, B.; Baser, K.H.C.; Yildiz, B.; Bahcecioglu, Z., Composition of the essential oils of six endemic Salvia spp. from Turkey, Flavour Fragr. J., 2003, 18, 2, 116-121, https://doi.org/10.1002/ffj.1173 . [all data]

Demirci, Demirci, et al., 2003
Demirci, B.; Demirci, F.; Baser, K.H.C., Composition of the essential oil of Cotinus coggygria Scop. from Turkey, Flavour Fragr. J., 2003, 18, 1, 43-44, https://doi.org/10.1002/ffj.1149 . [all data]

Baser, Demirci, et al., 2002
Baser, K.H.C.; Demirci, B.; Kirimer, N.; Satil, F.; Tumen, G., The essential oils of Thymus migricus and T. fedtschenkoi var. handelii from Turkey, Flavour Fragr. J., 2002, 17, 1, 41-45, https://doi.org/10.1002/ffj.1036 . [all data]

Kim and Lee, 2002
Kim, N.-S.; Lee, D.-S., Comparison of different extraction methods for the analysis of fragrances from Lavandula species by gas chromatography-mass spectrometry, J. Chromatogr. A, 2002, 982, 1, 31-47, https://doi.org/10.1016/S0021-9673(02)01445-0 . [all data]

Kaya, Demirci, et al., 2001
Kaya, A.; Demirci, B.; Baser, K.H.C., The composition of the essential oil of Stachys iberica subsp. stenostachya growing in Turkey, Chem. Nat. Compd. (Engl. Transl.), 2001, 37, 4, 326-328, https://doi.org/10.1023/A:1013762200024 . [all data]

Tabanca N., Demirci F., et al., 2001
Tabanca N.; Demirci F.; Ozek T.; Tumen G.; Baser K.H.C., Composition and antimicrobial activity of the essential oil of Origanum x dolichosiphon P. H. Davis, Chem. Nat. Compd. (Engl. Transl.), 2001, 37, 3, 238-241, https://doi.org/10.1023/A:1012513922871 . [all data]

Ahmed, Choudhary, et al., 2000
Ahmed, A.; Choudhary, M.I.; Farooq, A.; Demirci, B.; Demirci, F.; Baser, K.H.C., Essential oil constituents of the spice Cinnamomum tamala (Ham.) Nees Eberm., Flavour Fragr. J., 2000, 15, 6, 388-390, https://doi.org/10.1002/1099-1026(200011/12)15:6<388::AID-FFJ928>3.0.CO;2-F . [all data]

Bagci, Baser, et al., 1999
Bagci, E.; Baser, K.H.C.; Kürkcüoglu, M.; Babac, T.; Celik, S., Study of the essential oil composition of two subspecies of Abies cilicica (Ant. et Kotschy) Carr. from Turkey, Flavour Fragr. J., 1999, 14, 1, 47-49, https://doi.org/10.1002/(SICI)1099-1026(199901/02)14:1<47::AID-FFJ782>3.0.CO;2-R . [all data]

Castioni and Kapetanidis, 1996
Castioni, P.; Kapetanidis, I., Volatile constituents from Brunfelsia grandiflora ssp. grandiflora: qualitative analysis by GC-MS, Scientia Pharmaceutica, 1996, 64, 83-91. [all data]