2-Vinyl-4H-1,3-dithiine

Van Den Dool and Kratz RI, non-polar column, temperature ramp

Data compiled by: NIST Mass Spectrometry Data Center, William E. Wallace, director

Column type Capillary
Active phase DB-1
Column length (m) 60.
Carrier gas He
Substrate
Column diameter (mm) 0.25
Phase thickness (μm) 1.0
Tstart (C) 40.
Tend (C) 260.
Heat rate (K/min) 2.
Initial hold (min) 5.
Final hold (min) 60.
I 1199.
ReferenceYu, Lin, et al., 1994
Comment MSDC-RI

References

Yu, Lin, et al., 1994
Yu, T.-H.; Lin, L.-Y.; Ho, C.-T., Volatile compounds of blanched, fried blanched, and baked blanched garlic slices, J. Agric. Food Chem., 1994, 42, 6, 1342-1347, https://doi.org/10.1021/jf00042a018 . [all data]