14-Hydroxy-9-epi-(E)-caryophyllene

Kovats' RI, non-polar column, temperature ramp

Data compiled by: NIST Mass Spectrometry Data Center, William E. Wallace, director

Column type CapillaryCapillary
Active phase DB-5MSHP-5MS
Column length (m) 30.30.
Carrier gas HeHe
Substrate
Column diameter (mm) 0.250.25
Phase thickness (μm) 0.250.25
Tstart (C) 60.60.
Tend (C) 240.200.
Heat rate (K/min) 3.4.
Initial hold (min)  1.
Final hold (min)  15.
I 1669.1665.
ReferenceMaia, Andrade, et al., 2005Juliani, Zygadlo, et al., 2004
Comment MSDC-RI MSDC-RI

Normal alkane RI, non-polar column, custom temperature program

Data compiled by: NIST Mass Spectrometry Data Center, William E. Wallace, director

Column type CapillaryCapillaryCapillaryCapillaryCapillary
Active phase HP-5MSDB-5CP Sil 8 CBCP Sil 8 CBCP Sil 8 CB
Column length (m) 30.30.50.50.50.
Carrier gas HeHydrogenHeHeHe
Substrate
Column diameter (mm) 0.250.250.320.320.32
Phase thickness (μm) 0.250.250.250.250.25
Program 40C(10min) => 3C/min => 200C => 2C/min => 220Cnot specified50C(5min) => 2C/min => 90C => 15C/min => 240C(4min)60C(2min) => 5C/min => 160C(1min) => 10C/min => 250C (3min)50C(5min) => 2C/min => 90C => 15C/min => 240C(4min)
I 1669.1664.1670.1670.1670.
ReferenceCole, Haber, et al., 2007Pontes, de Olivera, et al., 2007Butkienë, Nivinskienë, et al., 2005Radudienë, Judpintienë, et al., 2005Butkienë, Nivinskienë, et al., 2004
Comment MSDC-RI MSDC-RI MSDC-RI MSDC-RI MSDC-RI
Column type Capillary
Active phase DB-5
Column length (m)
Carrier gas
Substrate
Column diameter (mm)
Phase thickness (μm)
Program not specified
I 1670.
ReferenceMorteza-Semnani and Vahedi, 2002
Comment MSDC-RI

References

Maia, Andrade, et al., 2005
Maia, J.G.S.; Andrade, E.H.A.; da Silva, A.C.M.; Oliveira, J.; Carreira, L.M.M.; Araújo, J.S., Leaf volatile oils from four Brazilian Xylopia species, Flavour Fragr. J., 2005, 20, 5, 474-477, https://doi.org/10.1002/ffj.1499 . [all data]

Juliani, Zygadlo, et al., 2004
Juliani, H.R.; Zygadlo, J.A.; Scrivanti, R.; de la Sota, E.; Simon, J.E., The essential oil of Anemia tomentosa (Savigny) Sw. var. anthriscifolia (Schrad.) Mickel, Flavour Fragr. J., 2004, 19, 6, 541-543, https://doi.org/10.1002/ffj.1341 . [all data]