3-Trimethylsiloxyvaleric acid, trimethylsilyl ester

Van Den Dool and Kratz RI, non-polar column, temperature ramp

View large format table.

Column type Active phase I Reference Comment
CapillaryCP Sil 5 CB1240.Halket, Przyborowska, et al., 199925. m/0.15 mm/0.12 μm, 90. C @ 1. min, 10. K/min, 270. C @ 7. min
CapillaryDB-51242.Kimura, Yamamoto, et al., 199930. m/0.25 mm/1. μm, He, 100. C @ 4. min, 4. K/min, 290. C @ 10. min
CapillaryOV-11245.Lefevere, Verhaeghe, et al., 198910. m/0.22 mm/0.17 μm, He, 5. K/min; Tstart: 70. C; Tend: 270. C
CapillarySE-521245.Lefevere, Verhaeghe, et al., 198925. m/0.32 mm/0.52 μm, He, 5. K/min; Tstart: 70. C; Tend: 270. C
CapillarySE-521240.Lefevere, Verhaeghe, et al., 198825. m/0.20 mm/0.40 μm, He, 5. K/min; Tstart: 50. C; Tend: 270. C
PackedOV-11239.Tanaka, Hine, et al., 1980N2, 100-120 mesh, 70. C @ 0.5 min, 28. K/min; Column length: 1.8 m; Tend: 290. C

Van Den Dool and Kratz RI, non-polar column, custom temperature program

View large format table.

Column type Active phase I Reference Comment
CapillaryDB-11238.Tsai, Oliphant, et al., 1985He; Program: not specified
PackedOV-1011239.Tanaka and Hine, 1982Program: not specified

Normal alkane RI, non-polar column, temperature ramp

View large format table.

Column type Active phase I Reference Comment
CapillaryHP-51245.Isidorov, Kotowska, et al., 200530. m/0.25 mm/0.25 μm, He; Tstart: 50. C; Tend: 300. C

References

Halket, Przyborowska, et al., 1999
Halket, J.N.; Przyborowska, A.; Stein, S.E.; Mallard, W.G.; Down, S.; Chalmers, R., Deconvolution gas chromatography / mass spectrometry of urinary organic acids - potential for pattern recognition and automated identification of metabolic disorders, Rapid Commun. Mass spectrom., 1999, 13, 4, 279-284, https://doi.org/10.1002/(SICI)1097-0231(19990228)13:4<279::AID-RCM478>3.0.CO;2-I . [all data]

Kimura, Yamamoto, et al., 1999
Kimura, M.; Yamamoto, T.; Yamaguchi, S., Automated metabolic profiling and interpretation of GC/MS data for organic acidemia screening: a personal computer-based system, Tohoku J. Exp. Med., 1999, 188, 4, 317-334, https://doi.org/10.1620/tjem.188.317 . [all data]

Lefevere, Verhaeghe, et al., 1989
Lefevere, M.F.; Verhaeghe, B.J.; Declerck, D.H.; Van Bocxlaer, J.F.; De Leenheer, A.P.; De Sagher, R.M., Metabolic Profiling of Urinary Organic Acids by Single and Multicolumn Capillary Gas Chromatography, J. Chromatogr. Sci., 1989, 27, 1, 23-29, https://doi.org/10.1093/chromsci/27.1.23 . [all data]

Lefevere, Verhaeghe, et al., 1988
Lefevere, M.F.; Verhaeghe, B.J.; Declerck, D.M.; de Leenheer, A.P., Automated profiling of urinary organic acids by dual-column gas chromatography and gas chromatography/mass spectrometry, Biomed. Environ. Mass Spectrom., 1988, 15, 6, 311-322, https://doi.org/10.1002/bms.1200150603 . [all data]

Tanaka, Hine, et al., 1980
Tanaka, K.; Hine, D.G.; West-Dull, A.; Lynn, T.B., Gas-chromatographic method of analysis for urinary organic acids. I. Retention indices of 155 metabolically important compounds, Clin. Chem., 1980, 26, 13, 1839-1846. [all data]

Tsai, Oliphant, et al., 1985
Tsai, M.Y.; Oliphant, C.; Josephson, M.W., Identification of Metabolites Diagnostic for Organic Acidurias by Simultaneous Dual-Column Capillary Gas Chromatography, J. Chromatogr., 1985, 341, 1-10, https://doi.org/10.1016/S0378-4347(00)84004-9 . [all data]

Tanaka and Hine, 1982
Tanaka, K.; Hine, D.G., Compilation of Gas Chromatographic Retention Indices of 163 Metabolically Important Organic Acids, and Their Use in Detection of Patients with Organic Acidurias, J. Chromatogr., 1982, 239, 301-322, https://doi.org/10.1016/S0021-9673(00)81990-1 . [all data]

Isidorov, Kotowska, et al., 2005
Isidorov, V.A.; Kotowska, U.; Vinogorova, V.T., GC Identification of organic compounds based on partition coefficients of their TMS derivatives in a hexane-acetonitrile system and retention indices, Anal. Sci., 2005, 21, 12, 1483-1489, https://doi.org/10.2116/analsci.21.1483 . [all data]