cis-1,1-Difluoro-2-methyl-3-vinylcyclopropane

Reaction thermochemistry data

Data compiled by: Hussein Y. Afeefy, Joel F. Liebman, and Stephen E. Stein

Individual Reactions

2Hydrogen + cis-1,1-Difluoro-2-methyl-3-vinylcyclopropane = C6H12F2

By formula: 2H2 + C6H8F2 = C6H12F2

Quantity Value Units Method Reference Comment
Δr-320. ± 0.4kJ/molChydRoth, Kirmse, et al., 1982liquid phase; solvent: Isooctane

References

Roth, Kirmse, et al., 1982
Roth, W.R.; Kirmse, W.; Hoffmann, W.; Lennartz, H.W., Heats of hydrogenation. III. Effect of fluoro substituents on the thermal rearrangement of cyclopropane systems, Chem. Ber., 1982, 115, 2508-2515. [all data]