3,5-Dihydroxybenzoic acid, 3TMS derivative

Van Den Dool and Kratz RI, non-polar column, temperature ramp

Data compiled by: NIST Mass Spectrometry Data Center, William E. Wallace, director

Column type PackedPacked
Active phase OV-1OV-1
Column length (m) 2.2.
Carrier gas N2He
Substrate SupelcoportChromosorb W HP (80-100 mesh)
Column diameter (mm)
Phase thickness (μm)
Tstart (C) 80.100.
Tend (C) 240.325.
Heat rate (K/min) 4.10.
Initial hold (min)
Final hold (min)
I 1828.1830.
ReferenceMattsson and Petersson, 1977Butts, 1972
Comment MSDC-RI MSDC-RI

References

Mattsson and Petersson, 1977
Mattsson, M.; Petersson, G., Reference GLC Data for the Analysis of Phenolic Compounds as Trimethylsilyl Derivatives, J. Chromatogr. Sci., 1977, 15, 12, 546-554, https://doi.org/10.1093/chromsci/15.12.546 . [all data]

Butts, 1972
Butts, W.C., Two-Column Gas Chromatography of Trimethylsilyl Derivatives of Biochemically Significant Compounds, Anal. Biochemistry, 1972, 46, 1, 187-199, https://doi.org/10.1016/0003-2697(72)90411-3 . [all data]