Benzene, 2-ethylseleno-1,3-dimethyl-

Gas phase ion energetics data

Data compiled by: Sharon G. Lias, Rhoda D. Levin, and Sherif A. Kafafi

Ionization energy determinations

IE (eV) Method Reference Comment
8.3PEBaker, Armen, et al., 1981Vertical value

References

Baker, Armen, et al., 1981
Baker, A.D.; Armen, G.H.; Guang-di, Y., Photoelectron spectra of alkyl aryl selenides. Electronic and steric factors in the observation of rotamers, J. Org. Chem., 1981, 46, 4127. [all data]