Carbazole, 1,4,8-trimethyl-

Normal alkane RI, non-polar column, temperature ramp

Data compiled by: NIST Mass Spectrometry Data Center, William E. Wallace, director

Column type Capillary
Active phase PONA
Column length (m) 50.
Carrier gas
Substrate
Column diameter (mm) 0.20
Phase thickness (μm) 0.50
Tstart (C) 120.
Tend (C) 270.
Heat rate (K/min) 1.5
Initial hold (min)
Final hold (min) 10.
I 1969.
ReferenceYang, Wang, et al., 2004
Comment MSDC-RI

References

Yang, Wang, et al., 2004
Yang, Y.; Wang, Z.; Yang, H.; Lu, W., Study on distribution of nitrogen compounds in catalytic diesel oil by gas chromatography - atomic emission detector, Chin. J. Chromatogr., 2004, 22, 5, 499-504. [all data]