e-Diazene, bis(bicyclo[2.2.2]oct-1-yl)-

Gas phase ion energetics data

Data compiled by: Sharon G. Lias and Joel F. Liebman

Ionization energy determinations

IE (eV) Method Reference Comment
7.86PEEngel, Gerth, et al., 1988Vertical value

References

Engel, Gerth, et al., 1988
Engel, P.S.; Gerth, D.B.; Keys, D.E.; Scholz, J.N.; Houk, K.N.; Rozeboom, M.D.; Eaton, T.A.; Glass, R.S.; Broeker, J.L., Ionization potentials of some azoalkanes by photoelectron spectroscopy, Tetrahedron, 1988, 44, 6811. [all data]