Tetraethyl silicate

Kovats' RI, non-polar column, isothermal

View large format table.

Column type Active phase Temperature (C) I Reference Comment
PackedApiezon L100.869.Kreshkov, Kirichenko, et al., 1975Ar; Column length: 1. m
PackedApiezon L150.850.Kreshkov, Kirichenko, et al., 1975Ar; Column length: 1. m
CapillaryApiezon L160.851.2Peetre, 1974Column length: 50. m; Column diameter: 0.25 mm

Kovats' RI, non-polar column, custom temperature program

View large format table.

Column type Active phase I Reference Comment
CapillaryApiezon L847.Peetre, 1974Column length: 50. m; Column diameter: 0.25 mm; Program: not specified

Normal alkane RI, non-polar column, isothermal

View large format table.

Column type Active phase Temperature (C) I Reference Comment
PackedApieson M160.850.Ellren, Peetre, et al., 1974Chromosorb G AW DMCS (80-100 mesh)

References

Kreshkov, Kirichenko, et al., 1975
Kreshkov, A.P.; Kirichenko, É.A.; Markov, B.A., Retention indices of alkoxychlorosilanes, Zh. Anal. Khim., 1975, 30, 2, 286-289. [all data]

Peetre, 1974
Peetre, I.-B., Gas chromatographic investigation of organometallic compounds and their carbon analogues. II. Improved method for calculating retention indices of tetraalkoxysilanes, J. Chromatogr., 1974, 88, 2, 311-321, https://doi.org/10.1016/S0021-9673(00)83155-6 . [all data]

Ellren, Peetre, et al., 1974
Ellren, O.; Peetre, I.B.; Smith, B.E.F., Gas chromatographic investigation of organometallic compounds and their carbon analogues. V. Use of refractive index in conjunction with Kovats retention index for the identification of organosilicon compounds, J. Chromatogr., 1974, 93, 2, 383-392, https://doi.org/10.1016/S0021-9673(01)85402-9 . [all data]