Silane, triethoxyethyl-

Phase change data

Data compiled as indicated in comments:
AC - William E. Acree, Jr., James S. Chickos

Enthalpy of vaporization

ΔvapH (kJ/mol) Temperature (K) Method Reference Comment
47.0353.IJenkins and Chambers, 1954Based on data from 338. - 426. K.; AC

Antoine Equation Parameters

log10(P) = A − (B / (T + C))
    P = vapor pressure (bar)
    T = temperature (K)

View plot Requires a JavaScript / HTML 5 canvas capable browser.

Temperature (K) A B C Reference
337.7 - 426.64.256381530.-74.Jenkins and Chambers, 1954

Kovats' RI, non-polar column, isothermal

View large format table.

Column type Active phase Temperature (C) I Reference Comment
PackedApiezon M160.859.Peetre, Ellren, et al., 1985Chromosorb G; Column length: 3. m

References

Jenkins and Chambers, 1954
Jenkins, Arthur C.; Chambers, George F., Vapor Pressures of Silicon Compounds, Ind. Eng. Chem., 1954, 46, 11, 2367-2369, https://doi.org/10.1021/ie50539a043 . [all data]