Oxiranecarboxylic acid, 3-methyl-3-phenyl-, ethyl ester

Van Den Dool and Kratz RI, non-polar column, temperature ramp

View large format table.

Column type Active phase I Reference Comment
CapillaryHP-51517.David, Scanlan, et al., 200050. m/0.32 mm/1.05 μm, He, 2. K/min; Tstart: 50. C; Tend: 290. C

Normal alkane RI, non-polar column, custom temperature program

View large format table.

Column type Active phase I Reference Comment
CapillaryHP-51517.0David, Scanlan, et al., 200250. m/0.32 mm/1.05 μm, He; Program: not specified

References

David, Scanlan, et al., 2000
David, F.; Scanlan, F.; Sandra, P., Retention time locking in flavor analysis, Proceedings 23rd ISCC; CD-ROM, 2000, retrieved from http://www.richrom.com/assets/CD23PDF. [all data]

David, Scanlan, et al., 2002
David, F.; Scanlan, F.; Sandra, P.; Szelewski, M., Analysis of essential oil compounds using retention time locked methods and retention time databases, 2002, retrieved from http://www.chem.agilent.com. [all data]