Benzene, 1,1'-(1-methylethylidene)bis-

Phase change data

Data compiled as indicated in comments:
BS - Robert L. Brown and Stephen E. Stein
TRC - Thermodynamics Research Center, NIST Boulder Laboratories, Chris Muzny director

Quantity Value Units Method Reference Comment
Tboil555. ± 2.KAVGN/AAverage of 7 values; Individual data points
Quantity Value Units Method Reference Comment
Tfus302.27KN/ASerijan and Wise, 1951Uncertainty assigned by TRC = 0.2 K; TRC
Tfus302.KN/ASabatier and Murat, 1915Uncertainty assigned by TRC = 4. K; TRC
Tfus302.KN/ASabatier and Murat, 1912Uncertainty assigned by TRC = 4. K; TRC

In addition to the Thermodynamics Research Center (TRC) data available from this site, much more physical and chemical property data is available from the following TRC products:

Condensed phase thermochemistry data

Data compiled by: Hussein Y. Afeefy, Joel F. Liebman, and Stephen E. Stein

Quantity Value Units Method Reference Comment
Δcsolid-1895.kcal/molCcbSerijan and Wise, 1951Corresponding Δfsolid = -62. kcal/mol (simple calculation by NIST; no Washburn corrections)

References

Serijan and Wise, 1951
Serijan, K.T.; Wise, P.H., Dicylic Hydrocarbons. III. Diphenyl- and Dicyclohexylalkanes through C15, J. Am. Chem. Soc., 1951, 73, 4766. [all data]

Sabatier and Murat, 1915
Sabatier, P.; Murat, M., Ann. Chim. (Paris), 1915, 4, 253. [all data]

Sabatier and Murat, 1912
Sabatier, P.; Murat, M., C. R. Hebd. Seances Acad. Sci., 1912, 155, 385. [all data]