5,5-dimethyl-2-phenyl-1,3-dioxane

Condensed phase thermochemistry data

Data compiled by: Hussein Y. Afeefy, Joel F. Liebman, and Stephen E. Stein

Quantity Value Units Method Reference Comment
Δfsolid-397.02 ± 0.86kJ/molCcrVerevkin, Dogan, et al., 1995See Beckhaus, Dogan, et al., 1990
Quantity Value Units Method Reference Comment
Δcsolid-6611.72 ± 0.42kJ/molCcrVerevkin, Dogan, et al., 1995See Beckhaus, Dogan, et al., 1990; Corresponding Δfsolid = -397.04 kJ/mol (simple calculation by NIST; no Washburn corrections)

References

Verevkin, Dogan, et al., 1995
Verevkin, S.P.; Dogan, B.; Hdrich, J.; Beckhaus, H.-D.; Rchardt, C., Geminal substituent effects. VIII. Enthalpies of formation of acetals, J. Prakt. Chem., 1995, 337, 93-98. [all data]

Beckhaus, Dogan, et al., 1990
Beckhaus, H.D.; Dogan, B.; Verevkin, S.; Hadrich, J.; Ruchardt, C., Dependence of anomeric stabilization on structure in acetals, Angew. Chem. Int. Ed. Engl., 1990, 29, 320-321. [all data]