Silane, [(6a,7,10,10a-tetrahydro-6,6,9-trimethyl-3-pentyl-6H-dibenzo[b,d]pyran-1,7-diyl)bis(oxy)]bis[trimethyl-, [6aR-(6aα,7α,10aβ)]-

Normal alkane RI, non-polar column, temperature ramp

View large format table.

Column type Active phase I Reference Comment
PackedSe-302650.Harvey, 1977N2, Gas Chrom Q, 2. K/min; Column length: 2.0 m; Tstart: 150. C; Tend: 290. C

References

Harvey, 1977
Harvey, D.J., Allyldimethylsilyl ethers as derivatives for the characterization of steroids and cannabinoids by combined gas chromatography and mass spectrometry, Biomed. Mass Spectrom., 1977, 4, 4, 265-274, https://doi.org/10.1002/bms.1200040414 . [all data]