Cedrol

Van Den Dool and Kratz RI, polar column, temperature ramp

Data compiled by: NIST Mass Spectrometry Data Center, William E. Wallace, director

Column type CapillaryCapillaryCapillaryCapillaryCapillary
Active phase Polyethylene GlycolBP-20BP-20DB-WaxDB-Wax
Column length (m) 30.50.50.60.60.
Carrier gas N2HeHeN2N2
Substrate
Column diameter (mm) 0.320.220.220.250.25
Phase thickness (μm) 0.250.250.250.250.25
Tstart (C) 50.60.60.70.70.
Tend (C) 230.220.220.230.230.
Heat rate (K/min) 2.2.2.2.2.
Initial hold (min) 10.  2.2.
Final hold (min) 15.20.20.20.20.
I 2102.2119.2127.2127.2112.
ReferenceDob, Dahmane, et al., 2006Duquesnoy, Dinh, et al., 2006Gonny, Cavaleiro, et al., 2006Njoroge, Koaze, et al., 2005Choi and Sawamura, 2000
Comment MSDC-RI MSDC-RI MSDC-RI MSDC-RI MSDC-RI
Column type CapillaryCapillaryCapillary
Active phase DB-WaxCarbowax 20MDB-Wax
Column length (m) 60.60.60.
Carrier gas HeHeHe
Substrate
Column diameter (mm) 0.250.320.20
Phase thickness (μm) 0.250.4250.20
Tstart (C) 50.45.70.
Tend (C) 180.300.180.
Heat rate (K/min) 2.53.2.
Initial hold (min) 5.3.5.
Final hold (min)  20.
I 2109.2112.2069.
ReferenceStashenko, Prada, et al., 1996Mondello, Dugo, et al., 1995Stashenko, Wiame, et al., 1995
Comment MSDC-RI MSDC-RI MSDC-RI

Normal alkane RI, non-polar column, temperature ramp

Data compiled by: NIST Mass Spectrometry Data Center, William E. Wallace, director

Column type CapillaryCapillaryCapillaryCapillaryCapillary
Active phase DB-5DB-5 MSVF-5 MSVF-5 MSRTX-1
Column length (m) 30.30.60.60.60.
Carrier gas HeliumHeliumHeliumHeliumHelium
Substrate
Column diameter (mm) 0.250.250.320.320.22
Phase thickness (μm) 0.250.250.250.250.25
Tstart (C) 40.60.30.30.60.
Tend (C) 250.270.260.260.230.
Heat rate (K/min) 3.3.2.2.2.
Initial hold (min) 5.
Final hold (min) 20. 28.28.30.
I 1604.1596.1616.1617.1603.
ReferenceCao, Li, et al., 2011Cui, Yang, et al., 2011Leffingwell and Alford, 2011Leffingwell and Alford, 2011Dib, Djabou, et al., 2010
Comment MSDC-RI MSDC-RI MSDC-RI MSDC-RI MSDC-RI
Column type CapillaryCapillaryCapillaryCapillaryCapillary
Active phase OV-1HP-5 MSHP-5 MSHP-5HP-5MS
Column length (m) 30.30.30.30.30.
Carrier gas HeliumHeliumHeliumHeliumHe
Substrate
Column diameter (mm) 0.250.250.250.250.25
Phase thickness (μm) 0.250.250.250.320.25
Tstart (C) 50.70.50.60.60.
Tend (C) 250.290.280.250.280.
Heat rate (K/min) 5.5.4.5.3.
Initial hold (min) 3.  30.
Final hold (min) 2.10.
I 1584.1611.1609.1596.1580.
ReferenceHu, Liang, et al., 2010Radulovic, Blagojevic, et al., 2010Zhao, Zeng, et al., 2009Yassa and Akhani, 2008Basta, Tzakou, et al., 2007
Comment MSDC-RI MSDC-RI MSDC-RI MSDC-RI MSDC-RI
Column type CapillaryCapillaryCapillaryCapillaryCapillary
Active phase HP-5DB-1SE-30HP-5DB-1
Column length (m) 30.60.30.30.60.
Carrier gas N2NitrogenHeHeNitrogen
Substrate
Column diameter (mm) 0.250.250.250.250.25
Phase thickness (μm) 0.250.250.250.250.25
Tstart (C) 50.60.40.40.60.
Tend (C) 240.250.250.250.250.
Heat rate (K/min) 5.4.5.5.4.
Initial hold (min) 1.1.5.5.1.
Final hold (min) 4.10.10.10.10.
I 1596.1562.1598.1596.1562.
ReferenceCheraif, Ben Jannet, et al., 2007Ghasempour, Shirinpour, et al., 2007Loizzo, Tundis, et al., 2007Loizzo, Tundis, et al., 2007Reza, Ebrahim, et al., 2007
Comment MSDC-RI MSDC-RI MSDC-RI MSDC-RI MSDC-RI
Column type CapillaryCapillaryCapillaryCapillaryCapillary
Active phase HP-5DB-5CP-Sil 5 CBDB-5DB-1
Column length (m) 30.30.25.30.60.
Carrier gas HeN2HydrogenHeN2
Substrate
Column diameter (mm) 0.250.250.250.250.25
Phase thickness (μm) 0.320.250.150.250.25
Tstart (C) 60.70.50.40.60.
Tend (C) 250.230.230.260.250.
Heat rate (K/min) 5.2.3.2.5.
Initial hold (min) 30.2. 5.
Final hold (min)  20. 20.10.
I 1596.1587.1611.1597.1615.
ReferenceYassa and Akhani, 2007Choi, 2006Olawore, Usman, et al., 2006Senatore, Landolfi, et al., 2006Fakhari A.R., Sonboli A., et al., 2005
Comment MSDC-RI MSDC-RI MSDC-RI MSDC-RI MSDC-RI
Column type CapillaryCapillaryCapillaryCapillaryCapillary
Active phase HP-5MSHP-5MSHP-5DB-5DB-5
Column length (m) 30.30.30.30.30.
Carrier gas HeHeHeliumHeHe
Substrate
Column diameter (mm) 0.250.250.320.250.25
Phase thickness (μm) 0.250.25 0.250.25
Tstart (C) 60.60.70.60.35.
Tend (C) 280.280.210.240.280.
Heat rate (K/min) 4.4.2.3.4.
Initial hold (min)     2.
Final hold (min)   60. 15.
I 1598.1596.1596.1598.1615.
ReferenceSajjadi S.E. and Eskandari B., 2005Ghasemi, Asghari, et al., 2003Mookdasanit, Tamura, et al., 2003da Silva, Luz, et al., 2003Krauze-Baranowska, Mardarowicz, et al., 2002
Comment MSDC-RI MSDC-RI MSDC-RI MSDC-RI MSDC-RI
Column type CapillaryCapillaryCapillaryCapillaryCapillary
Active phase DB-5MSBP-1OV-101SPB-5HP-101
Column length (m) 30.25.50.50.25.
Carrier gas HeN2N2HeHe
Substrate
Column diameter (mm) 0.250.330.20.320.2
Phase thickness (μm) 0.251.0 0.250.2
Tstart (C) 60.60.80.60.70.
Tend (C) 240.275.200.240.200.
Heat rate (K/min) 3.4.1.3.3.
Initial hold (min)     2.
Final hold (min) 30. 20.20.10.
I 1573.1596.1609.1615.1580.
ReferenceMarongiu, Porcedda, et al., 2001Mohagheghzadeh, Shams-Ardakani, et al., 2000Menon, Chacko, et al., 1999Doneanu and Anitescu, 1998Milso, Mastelic, et al., 1998
Comment MSDC-RI MSDC-RI MSDC-RI MSDC-RI MSDC-RI
Column type CapillaryCapillaryCapillaryCapillaryCapillary
Active phase DB-5DB-1DB-1Methyl SiliconeMethyl Silicone
Column length (m) 30.60.60.50.50.
Carrier gas HeHeHeN2N2
Substrate
Column diameter (mm) 0.250.250.250.250.25
Phase thickness (μm) 0.250.250.250.170.17
Tstart (C) 65.50.50.80.80.
Tend (C) 300.250.250.200.200.
Heat rate (K/min) 4.2.53.52.3.
Initial hold (min) 2.5.5.
Final hold (min)
I 1625.1609.1584.1609.1608.
ReferenceElias, Simoneit, et al., 1997Stashenko, Puertas, et al., 1996Stashenko, Torres, et al., 1995Gopalakrishnan, Menon, et al., 1993Gopalakrishnan, Menon, et al., 1993
Comment MSDC-RI MSDC-RI MSDC-RI MSDC-RI MSDC-RI
Column type Capillary
Active phase SE-30+Igepal
Column length (m) 100.
Carrier gas
Substrate
Column diameter (mm) 0.25
Phase thickness (μm)
Tstart (C) 70.
Tend (C) 170.
Heat rate (K/min) 1.
Initial hold (min)
Final hold (min)
I 1614.
ReferenceShibamoto and Jennings, 1977
Comment MSDC-RI

Van Den Dool and Kratz RI, non-polar column, temperature ramp

Data compiled by: NIST Mass Spectrometry Data Center, William E. Wallace, director

Column type CapillaryCapillaryCapillaryCapillaryCapillary
Active phase DB-5HP-5MSDB-5BP-1BP-1
Column length (m) 30.30.30.50.50.
Carrier gas HeHeN2HeHe
Substrate
Column diameter (mm) 0.250.250.250.220.22
Phase thickness (μm) 0.250.250.250.250.25
Tstart (C) 60.80.60.60.60.
Tend (C) 240.300.240.220.220.
Heat rate (K/min) 3.4.3.2.2.
Initial hold (min)   3.
Final hold (min)   3.20.20.
I 1600.1607.91597.1595.1598.
ReferenceFlamini, Cioni, et al., 2007Zeng, Zhao, et al., 2007Dob, Dahmane, et al., 2006Duquesnoy, Dinh, et al., 2006Gonny, Cavaleiro, et al., 2006
Comment MSDC-RI MSDC-RI MSDC-RI MSDC-RI MSDC-RI
Column type CapillaryCapillaryCapillaryCapillaryCapillary
Active phase DB-1HP-5MSCP Sil 5 CBDB-1HP-5
Column length (m) 30.30.25.30.30.
Carrier gas N2HeH2 N2
Substrate
Column diameter (mm) 0.250.250.250.320.25
Phase thickness (μm) 0.250.25 0.250.25
Tstart (C) 50.80.80.50.60.
Tend (C) 220.300.270.250.220.
Heat rate (K/min) 4.4.10.2.5.
Initial hold (min)    8.10.
Final hold (min)
I 1592.1605.81603.1582.1598.
ReferenceKuiate, Bessière, et al., 2006Zhao C.X., Li, et al., 2006Ziegenbein, Hanssen, et al., 2006Dob, Dahmane, et al., 2005Flamini, Luigi Cioni, et al., 2005
Comment MSDC-RI MSDC-RI MSDC-RI MSDC-RI MSDC-RI
Column type CapillaryCapillaryCapillaryCapillaryCapillary
Active phase SE-54HP-5MSHP-5DB-5SPB-1
Column length (m) 25.30.30.30.30.
Carrier gas H2HeN2N2He
Substrate
Column diameter (mm) 0.250.250.250.250.2
Phase thickness (μm) 0.20.250.250.250.2
Tstart (C) 50.60.60.60.70.
Tend (C) 250.280.220.220.220.
Heat rate (K/min) 4.3.5.5.3.
Initial hold (min)   10.10.
Final hold (min)     15.
I 1597.1608.1597.1597.1575.
ReferenceSimionatto, Porto, et al., 2005Aligiannis, Kalpoutzakis, et al., 2004Angelini, Carpanese, et al., 2003Bader, Caponi, et al., 2003Cavaleiro, Salgueiro, et al., 2003
Comment MSDC-RI MSDC-RI MSDC-RI MSDC-RI MSDC-RI
Column type CapillaryCapillaryCapillaryCapillaryCapillary
Active phase HP-5HP-5MSDB-5HP-5MSSE-54
Column length (m) 30.30.30.30.25.
Carrier gas He H2He
Substrate
Column diameter (mm) 0.250.250.250.250.31
Phase thickness (μm) 0.250.250.250.25
Tstart (C) 60.50.60.60.35.
Tend (C) 280.280.240.280.230.
Heat rate (K/min) 4.3.3.4.4.
Initial hold (min) 5.5. 5.3.
Final hold (min)     10.
I 1599.1596.1604.1599.1594.32
ReferenceSkaltsa, Demetzos, et al., 2003Demetzos, Angelopoulou, et al., 2002Nogueira, Bittrich, et al., 2001Skaltsa, Mavrommati, et al., 2001Yin, Xiu, et al., 2001
Comment MSDC-RI MSDC-RI MSDC-RI MSDC-RI MSDC-RI
Column type CapillaryCapillaryCapillaryCapillaryCapillary
Active phase SE-54HP-5Methyl SiliconeSE-54SE-54
Column length (m) 25.30.50.25.25.
Carrier gas  HeN2H2H2
Substrate
Column diameter (mm) 0.310.250.250.310.31
Phase thickness (μm)  0.250.17
Tstart (C) 35.70.80.35.35.
Tend (C) 230.230.200.250.250.
Heat rate (K/min) 4.2.2.4.4.
Initial hold (min) 3.  3.3.
Final hold (min) 10.
I 1596.871589.1612.1584.1586.
ReferenceYin, Xiu, et al., 2001Song, Sawamura, et al., 2000Sumathykutty, Rao, et al., 1999Li, Wang, et al., 1998Li, Wang, et al., 1998
Comment MSDC-RI MSDC-RI MSDC-RI MSDC-RI MSDC-RI
Column type CapillaryCapillary
Active phase DB-1DB-1
Column length (m) 60.30.
Carrier gas HeHe
Substrate
Column diameter (mm) 0.250.20
Phase thickness (μm) 0.250.20
Tstart (C) 50.70.
Tend (C) 250.200.
Heat rate (K/min) 3.54.
Initial hold (min) 5.5.
Final hold (min)
I 1585.1622.
ReferenceStashenko, Prada, et al., 1996Stashenko, Wiame, et al., 1995
Comment MSDC-RI MSDC-RI

Normal alkane RI, non-polar column, custom temperature program

Data compiled by: NIST Mass Spectrometry Data Center, William E. Wallace, director

Column type CapillaryCapillaryCapillaryCapillaryCapillary
Active phase DB-5RTX-1DB-1HP-5CP Sil 8 CB
Column length (m) 30.60.30.30.30.
Carrier gas HeliumHeliumHydrogen
Substrate
Column diameter (mm) 0.250.220.250.320.25
Phase thickness (μm) 0.250.250.25 0.25
Program not specifiednot specified45 0C 3 0C/min -> 175 0C 15 0C/min -> 300 0C (10 min)not specified60C => 2.5C/min => 170C => 10C/min => 250C (5min)
I 1604.1596.1574.1596.1596.
ReferenceCao, Li, et al., 2011Dib, Djabou, et al., 2010Mendes, Trindade, et al., 2009Riahi, Pourbasheer, et al., 2009Kristiawan, Sobolik, et al., 2008
Comment MSDC-RI MSDC-RI MSDC-RI MSDC-RI MSDC-RI
Column type CapillaryCapillaryCapillaryCapillaryCapillary
Active phase DB-5 MSDB-5 MSSE-52OV-1DB-5
Column length (m) 30.30.30.30.30.
Carrier gas HeliumHeliumHeHeHe
Substrate
Column diameter (mm) 0.250.250.320.250.25
Phase thickness (μm) 0.250.250.150.250.25
Program 50 0C (2.8 min) 5.5 0C/min -> 140 0C (1 min) 4.5 oC/min -> 220 0C -> 225 0C (2 min) 3.4 0C/min -> 265 0C (5 min)50 0C (2.8 min) 5.5 0C/min -> 140 0C (1 min) 4.5 oC/min -> 220 0C -> 225 0C (2 min) 3.4 0C/min -> 265 0C (5 min)45C => 1C/min => 100C => 5C/min => 250C (10min)45 0C (4 min) 3 0C/min -> 75 0C 4 0C/min -> 115 0C 6 0C/min -> 312 0C40C(1min) => 9C/min => 130C => 2C/min => 230C
I 1578.1607.1601.1586.1604.
ReferenceZhu, Li, et al., 2008Zhu, Li, et al., 2008Tognolini, Barocelli, et al., 2006Hafez and Abdel-Salam, 2004Hamm, Bleton, et al., 2004
Comment MSDC-RI MSDC-RI MSDC-RI MSDC-RI MSDC-RI
Column type CapillaryCapillaryCapillaryCapillaryCapillary
Active phase SE-30SE-54DB-1Polydimethyl siloxanesOV-101
Column length (m)  25.30.
Carrier gas  H2H2
Substrate
Column diameter (mm)  0.250.25
Phase thickness (μm)  0.250.25
Program not specified110C(2min) => 3C/min => 130C => 8.5C => 290C40 0C 3 K/min -> 175 0C 15 K/min -> 240 0C (10 min)not specifiednot specified
I 1602.1616.1574.1602.1609.
ReferenceVinogradov, 2004Lima, Veiga, et al., 2003da Silva, Pedro, et al., 2000Zenkevich, 1997Shibamoto, 1987
Comment MSDC-RI MSDC-RI MSDC-RI MSDC-RI MSDC-RI

References

Dob, Dahmane, et al., 2006
Dob, T.; Dahmane, D.; Agli, M.; Chelghoum, C., Essential oil composition of Lavandula stoechas from Algeria, Pharm. Biol., 2006, 44, 1, 60-64, https://doi.org/10.1080/13880200500496421 . [all data]

Duquesnoy, Dinh, et al., 2006
Duquesnoy, E.; Dinh, N.H.; Castola, V.; Casanova, J., Composition of a Pyrolytic oil from Cupressus funebris Endl. of Vietnamese origin, Flavour Fragr. J., 2006, 21, 3, 453-457, https://doi.org/10.1002/ffj.1676 . [all data]

Gonny, Cavaleiro, et al., 2006
Gonny, M.; Cavaleiro, C.; Salgueiro, L.; Casanova, J., Analysis of Juniperus communis subsp. alpina needle, berry, wood and root oils by combination of GC, GC/MS and 13C-NMR, Flavour Fragr. J., 2006, 21, 1, 99-106, https://doi.org/10.1002/ffj.1527 . [all data]

Njoroge, Koaze, et al., 2005
Njoroge, S.M.; Koaze, H.; Karanja, P.N.; Sawamura, M., Volatile Constituents of Redblush Grapefruit ( Citrus paradisi) and Pummelo ( Citrus grandis) Peel Essential Oils from Kenya, J. Agric. Food Chem., 2005, 53, 25, 9790-9794, https://doi.org/10.1021/jf051373s . [all data]

Choi and Sawamura, 2000
Choi, H.-S.; Sawamura, M., Composition of the essential oil of Citrus tamurana Hort. ex Tanaka (Hyuganatsu), J. Agric. Food Chem., 2000, 48, 10, 4868-4873, https://doi.org/10.1021/jf000651e . [all data]

Stashenko, Prada, et al., 1996
Stashenko, E.E.; Prada, N.Q.; Martínez, J.R., HRGC/FID/NP and HRGC/MSD study of Colombian Ylang-Ylang (Cananga odorata) oils obtained by different extraction techniques, J. Hi. Res. Chromatogr., 1996, 19, 6, 353-358, https://doi.org/10.1002/jhrc.1240190609 . [all data]

Mondello, Dugo, et al., 1995
Mondello, L.; Dugo, P.; Basile, A.; Dugo, G., Interactive use of linear retention indices, on polar and apolar columns, with a MS-library for reliable identification of complex mixtures, J. Microcolumn Sep., 1995, 7, 6, 581-591, https://doi.org/10.1002/mcs.1220070605 . [all data]

Stashenko, Wiame, et al., 1995
Stashenko, E.; Wiame, H.; Dassy, S.; Martinez, J.R.; Shibamoto, T., Catalytic transformation of copaiba (Copaifera officinalis) oil over zeolite ZSM-5, J. Hi. Res. Chromatogr., 1995, 18, 1, 54-58, https://doi.org/10.1002/jhrc.1240180112 . [all data]