9,12,15-Octadecatrienoic acid, phenylmethyl ester, (Z,Z,Z)-

Van Den Dool and Kratz RI, non-polar column, temperature ramp

View large format table.

Column type Active phase I Reference Comment
CapillaryHP-52702.Zhao, Wang X.Y., et al., 200630. m/0.25 mm/0.25 μm, He, 50. C @ 3. min, 10. K/min; Tend: 260. C

Van Den Dool and Kratz RI, non-polar column, custom temperature program

View large format table.

Column type Active phase I Reference Comment
CapillaryHP-5MS2774.9Andriamaharavo, 201430. m/0.25 mm/0.25 μm, He; Program: 60C (1 min) => 5 C/min => 210C => 10 C/min => 280C (15 min)

References

Zhao, Wang X.Y., et al., 2006
Zhao, Y.P.; Wang X.Y.; Wang, Z.C.; Lu Y.; Fu, C.X.; Chen, S.Y., Essential oil of Actinidia macrosperma, a catnip response kiwi endemic to China, Journal of Zhejiang University SCIENCE B, 2006, 7, 9, 708-712, https://doi.org/10.1631/jzus.2006.B0708 . [all data]

Andriamaharavo, 2014
Andriamaharavo, N.R., Retention Data. NIST Mass Spectrometry Data Center., NIST Mass Spectrometry Data Center, 2014. [all data]