1-Carboxycyclopropane-2-acetic acid (Z), dimethyl ester

Normal alkane RI, non-polar column, temperature ramp

Data compiled by: NIST Mass Spectrometry Data Center, William E. Wallace, director

Column type Capillary
Active phase OV-101
Column length (m) 25.
Carrier gas
Substrate
Column diameter (mm)
Phase thickness (μm)
Tstart (C) 80.
Tend (C) 280.
Heat rate (K/min) 2.
Initial hold (min) 5.
Final hold (min)
I 1175.
ReferenceBauer, Neupert, et al., 1984
Comment MSDC-RI

References

Bauer, Neupert, et al., 1984
Bauer, S.; Neupert, M.; Spiteller, G., Characterization of artefacts produced by treatment of organic acids with diazomethane, J. Chromatogr., 1984, 309, 243-259, https://doi.org/10.1016/0378-4347(84)80032-8 . [all data]