m-Methoxybenzoic acid, pentyl ester

Van Den Dool and Kratz RI, non-polar column, temperature ramp

View large format table.

Column type Active phase I Reference Comment
CapillaryVF-5MS1735.Todua, 201130. m/0.25 mm/0.25 μm, He; Tstart: 60. C; Tend: 270. C

Van Den Dool and Kratz RI, non-polar column, custom temperature program

View large format table.

Column type Active phase I Reference Comment
Capillary5 % Phenyl methyl siloxane1719.8Zaikin, 2003Column length: 30. m; Column diameter: 0.19 mm; Program: 50 C to 120 C at 5 C/min; 120 C to 290 C at 12 C/min

References

Todua, 2011
Todua, N.G., Retention Data. NIST Mass Spectrometry Data Center., NIST Mass Spectrometry Data Center, 2011. [all data]

Zaikin, 2003
Zaikin, V.G., Personal Communication: Retention indices measured during the period 2001 to 2003, 2003. [all data]