(Z)-Cinnamyl acetate

Kovats' RI, non-polar column, temperature ramp

View large format table.

Column type Active phase I Reference Comment
CapillaryBP-11409.Raina, Srivastava, et al., 200125. m/0.55 mm/0.25 μm, N2, 5. K/min, 220. C @ 15. min; Tstart: 60. C

References

Raina, Srivastava, et al., 2001
Raina, V.K.; Srivastava, S.K.; Aggarwal, K.K.; Ramesh, S.; Kumar, S., Essential oil composition of Cinnamomum zeylanicum Blume leaves from Little Andaman, India, Flavour Fragr. J., 2001, 16, 5, 374-376, https://doi.org/10.1002/ffj.1016 . [all data]