2H-Pyran-2-one, 3-acetyl-4-hydroxy-6-methyl-

Normal alkane RI, non-polar column, temperature ramp

Data compiled by: NIST Mass Spectrometry Data Center, William E. Wallace, director

Column type Capillary
Active phase OV-1
Column length (m) 30.
Carrier gas Helium
Substrate
Column diameter (mm) 0.25
Phase thickness (μm) 0.25
Tstart (C) 50.
Tend (C) 250.
Heat rate (K/min) 5.
Initial hold (min) 3.
Final hold (min) 2.
I 1679.
ReferenceHu, Liang, et al., 2010
Comment MSDC-RI

References

Hu, Liang, et al., 2010
Hu, C.-D.; Liang, Y.-Z.; Guo, F.-Q.; Li, X.-R.; Wang, W.-P., Determination of essential oil composition from Osmanthus fragrans tea by GC-MS combined with a chemometric resolution method, Molecules, 2010, 15, 5, 3683-3693, https://doi.org/10.3390/molecules15053683 . [all data]