Benzilic acid

Phase change data

Data compiled by: Thermodynamics Research Center, NIST Boulder Laboratories, Chris Muzny director

Quantity Value Units Method Reference Comment
Tfus422.KN/ASmith, Alderman, et al., 1949Uncertainty assigned by TRC = 3. K
Tfus423.KN/APearl and Dehn, 1938Uncertainty assigned by TRC = 3. K

In addition to the Thermodynamics Research Center (TRC) data available from this site, much more physical and chemical property data is available from the following TRC products:

References

Smith, Alderman, et al., 1949
Smith, H.A.; Alderman, D.M.; Shacklett, C.D.; Welch, C.M., The Catalytic Hydrogenation of the Benzene Nucleus VI. The Hydrogenation of Compounds with Two Benzene Rings, J. Am. Chem. Soc., 1949, 71, 3772. [all data]

Pearl and Dehn, 1938
Pearl, I.A.; Dehn, W.M., Reduction fo Benzil, J. Am. Chem. Soc., 1938, 60, 57. [all data]