1-Iodoadamantane

Phase change data

Data compiled as indicated in comments:
TRC - Thermodynamics Research Center, NIST Boulder Laboratories, Chris Muzny director
AC - William E. Acree, Jr., James S. Chickos
CAL - James S. Chickos, William E. Acree, Jr., Joel F. Liebman, Students of Chem 202 (Introduction to the Literature of Chemistry), University of Missouri -- St. Louis

Quantity Value Units Method Reference Comment
Tfus347.0KN/AClark, Knox, et al., 1977Crystal phase 1 phase; Uncertainty assigned by TRC = 0.2 K; TRC

Enthalpy of fusion

ΔfusH (kJ/mol) Temperature (K) Reference Comment
10.22347.Clark, Knox, et al., 1977AC

Entropy of fusion

ΔfusS (J/mol*K) Temperature (K) Reference Comment
10.7211.Clark, Knox, et al., 1977CAL
51.1347.

In addition to the Thermodynamics Research Center (TRC) data available from this site, much more physical and chemical property data is available from the following TRC products:

References

Clark, Knox, et al., 1977
Clark, Timothy; Knox, Trevor Mc.O.; Mackle, Henry; McKervey, M. Anthony, Order--disorder transitions in substituted adamantanes, J. Chem. Soc., Faraday Trans. 1, 1977, 73, 0, 1224, https://doi.org/10.1039/f19777301224 . [all data]